Ru(Cp*)(dmpe)(Cl)
- Formula: C16H31ClP2Ru
- Molecular weight: 421.89

Reaction thermochemistry data

Data compiled by: José A. Martinho Simões
Individual Reactions
C18H27ClRu (solution) + (solution) = C16H31ClP2Ru (solution) +
(solution)
By formula: C18H27ClRu (solution) + C10H15NO2 (solution) = C16H31ClP2Ru (solution) + C8H12 (solution)
Quantity | Value | Units | Method | Reference | Comment |
---|---|---|---|---|---|
ΔrH° | -34.8 ± 0.2 | kcal/mol | RSC | Luo, Zhu, et al., 1994 | solvent: Tetrahydrofuran; The enthalpy of solution of Ru(Cp*)(cod)(Cl)(cr) was measured as 4.9 ± 0.2 kcal/mol Luo, Nolan, et al., 1993. |

References

Luo, Zhu, et al., 1994
Luo, L.; Zhu, N.; Zhu, N.-J.; Stevens, E.D.; Nolan, S.P.; Fagan, P.J.,
Organometallics, 1994, 13, 669. [all data]
Luo, Nolan, et al., 1993
Luo, L.; Nolan, S.P.; Fagan, P.J.,
Organometallics, 1993, 12, 4305. [all data]