Al2(Cl)3(Oc)3
- Formula: C24H51Al2Cl3
- Molecular weight: 499.984

Condensed phase thermochemistry data

Data compiled by: José A. Martinho Simões
Quantity | Value | Units | Method | Reference | Comment |
---|---|---|---|---|---|
ΔfH°liquid | -102.2 ± 7.6 | kJ/mol | Review | Martinho Simões | |
Quantity | Value | Units | Method | Reference | Comment |
ΔcH°liquid | -18379.1 ± 6.7 | kJ/mol | CC-SB | Pawlenko, 1969 | The enthalpy of combustion was corrected according to the method used in Pawlenko, 1969. |

References

Martinho Simões
Martinho Simões, J.A.,
Private communication (see http://webbook.nist.gov/chemistry/om/). [all data]
Pawlenko, 1969
Pawlenko, S.,
Chem. Ber., 1969, 102, 1937. [all data]