Al(Cl)2(Bu)
- Formula: C4H9AlCl2
- Molecular weight: 155.002

Condensed phase thermochemistry data

Data compiled by: José A. Martinho Simões
Quantity | Value | Units | Method | Reference | Comment |
---|---|---|---|---|---|
ΔfH°liquid | -73.06 ± 0.38 | kcal/mol | Review | Martinho Simões | |
Quantity | Value | Units | Method | Reference | Comment |
ΔcH°liquid | -822.39 ± 0.31 | kcal/mol | CC-SB | Pawlenko, 1969 | The enthalpy of combustion was corrected according to the method used in Pawlenko, 1969. |

References

Martinho Simões
Martinho Simões, J.A.,
Private communication (see http://webbook.nist.gov/chemistry/om/). [all data]
Pawlenko, 1969
Pawlenko, S.,
Chem. Ber., 1969, 102, 1937. [all data]