Al(Cl)(Bu)2
- Formula: C8H18AlCl
- Molecular weight: 176.663

Condensed phase thermochemistry data

Data compiled by: José A. Martinho Simões
Quantity | Value | Units | Method | Reference | Comment |
---|---|---|---|---|---|
ΔfH°liquid | -533.0 ± 2.5 | kJ/mol | Review | Martinho Simões | |
Quantity | Value | Units | Method | Reference | Comment |
ΔcH°liquid | -6049.6 ± 2.1 | kJ/mol | CC-SB | Pawlenko, 1969 | The enthalpy of combustion was corrected according to the method used in Pawlenko, 1969. |

References

Martinho Simões
Martinho Simões, J.A.,
Private communication (see http://webbook.nist.gov/chemistry/om/). [all data]
Pawlenko, 1969
Pawlenko, S.,
Chem. Ber., 1969, 102, 1937. [all data]