Al(Cl)2(Pr)
- Formula: C3H7AlCl2
- Molecular weight: 140.975

Condensed phase thermochemistry data

Data compiled by: José A. Martinho Simões
Quantity | Value | Units | Method | Reference | Comment |
---|---|---|---|---|---|
ΔfH°liquid | -497.1 ± 1.9 | kJ/mol | Review | Martinho Simões | |
Quantity | Value | Units | Method | Reference | Comment |
ΔcH°liquid | -2570.2 ± 1.7 | kJ/mol | CC-SB | Pawlenko, 1969 | The enthalpy of combustion was corrected according to the method used in Pawlenko, 1969. |

References

Martinho Simões
Martinho Simões, J.A.,
Private communication (see http://webbook.nist.gov/chemistry/om/). [all data]
Pawlenko, 1969
Pawlenko, S.,
Chem. Ber., 1969, 102, 1937. [all data]