Al(Cl)(Pr)2
- Formula: C6H14AlCl
- Molecular weight: 148.610

Condensed phase thermochemistry data

Data compiled by: José A. Martinho Simões
Quantity | Value | Units | Method | Reference | Comment |
---|---|---|---|---|---|
ΔfH°liquid | -99.76 ± 0.48 | kcal/mol | Review | Martinho Simões | |
Quantity | Value | Units | Method | Reference | Comment |
ΔcH°liquid | -1148.8 ± 0.41 | kcal/mol | CC-SB | Pawlenko, 1969 | The enthalpy of combustion was corrected according to the method used in Pawlenko, 1969. |

References

Martinho Simões
Martinho Simões, J.A.,
Private communication (see http://webbook.nist.gov/chemistry/om/). [all data]
Pawlenko, 1969
Pawlenko, S.,
Chem. Ber., 1969, 102, 1937. [all data]