V(O)(OBu)3
- Formula: C12H27O4V
- Molecular weight: 286.2819

Condensed phase thermochemistry data

Data compiled by: José A. Martinho Simões
Quantity | Value | Units | Method | Reference | Comment |
---|---|---|---|---|---|
ΔfH°liquid | -1307. ± 16. | kJ/mol | Review | Martinho Simões | |
Quantity | Value | Units | Method | Reference | Comment |
ΔcH°liquid | -8049. ± 16. | kJ/mol | CC-SB | Lachowicz, Trober, et al., 1978 | Temperature: 293 K. |

Phase change data

Data compiled by: José A. Martinho Simões
Quantity | Value | Units | Method | Reference | Comment |
---|---|---|---|---|---|
ΔvapH° | 162.3 | kJ/mol | CC-SB | Lachowicz, Trober, et al., 1978 | The enthalpy of vaporization at 298 K, 159.1 kJ/mol, is calculated from data in Lachowicz, Trober, et al., 1978. |

Gas phase thermochemistry data

Data compiled by: José A. Martinho Simões
Quantity | Value | Units | Method | Reference | Comment |
---|---|---|---|---|---|
ΔfH°gas | -1144.8 | kJ/mol | Review | Martinho Simões |

References

Martinho Simões
Martinho Simões, J.A.,
Private communication (see http://webbook.nist.gov/chemistry/om/). [all data]
Lachowicz, Trober, et al., 1978
Lachowicz, A.; Trober, A.; Bieraeugel, I.; Adler, B.,
Investigations on vanadic acid esters. III. Energy data from trialkyl o-vanadates,
Z. Phys. Chem. (Leipzig), 1978, 259, 1121. [all data]