Sn(Pe)4

Condensed phase thermochemistry data

Data compiled by: José A. Martinho Simões

Quantity Value Units Method Reference Comment
Δfliquid-577.4kJ/molReviewMartinho Simões
Quantity Value Units Method Reference Comment
Δcliquid-14158.7kJ/molCC-SBJones, Evans, et al., 1935

References

Martinho Simões
Martinho Simões, J.A., Private communication (see http://webbook.nist.gov/chemistry/om/). [all data]

Jones, Evans, et al., 1935
Jones, W.J.; Evans, D.P.; Gulwell, T.; Griffiths, D.C., J. Chem. Soc., 1935, 39.. [all data]