Sn(Et)2(H)2

Phase change data

Data compiled by: José A. Martinho Simões

Quantity Value Units Method Reference Comment
Δvap30.2kJ/molN/ADillard, McNeill, et al., 1958

References

Dillard, McNeill, et al., 1958
Dillard, C.R.; McNeill, E.H.; Simmons, D.E.; Yeldell, J.B., J. Am. Chem. Soc., 1958, 80, 3607. [all data]