W(PhMe)2
- Formula: C14H16W
- Molecular weight: 368.12

Condensed phase thermochemistry data

Data compiled by: José A. Martinho Simões
Quantity | Value | Units | Method | Reference | Comment |
---|---|---|---|---|---|
ΔfH°solid | 243.3 ± 7.1 | kJ/mol | Review | Martinho Simões | |
ΔfH°solid | 242.5 ± 7.1 | kJ/mol | Review | Martinho Simões | |
ΔfH°solid | 242.9 ± 5.0 | kJ/mol | Review | Martinho Simões | Selected data. Average of the values from Connor, El-Saied, et al., 1981. |

Phase change data

Data compiled by: José A. Martinho Simões
Quantity | Value | Units | Method | Reference | Comment |
---|---|---|---|---|---|
ΔsubH° | 110. ± 8. | kJ/mol | TD-HFC | Connor, El-Saied, et al., 1981 |

Gas phase thermochemistry data

Data compiled by: José A. Martinho Simões
Quantity | Value | Units | Method | Reference | Comment |
---|---|---|---|---|---|
ΔfH°gas | 84.4 ± 2.6 | kcal/mol | Review | Martinho Simões | |
ΔfH°gas | 84.2 ± 2.6 | kcal/mol | Review | Martinho Simões | |
ΔfH°gas | 84.3 ± 2.2 | kcal/mol | Review | Martinho Simões | Selected data. Average of the values from Connor, El-Saied, et al., 1981. |

References

Martinho Simões
Martinho Simões, J.A.,
Private communication (see http://webbook.nist.gov/chemistry/om/). [all data]
Connor, El-Saied, et al., 1981
Connor, J.A.; El-Saied, N.I.; Martinho Simões, J.A.; Skinner, H.A.,
J. Organometal. Chem., 1981, 212, 405. [all data]