Ir4(CO)12
- Formula: C12Ir4O12
- Molecular weight: 1104.989

Gas phase thermochemistry data

Data compiled by: José A. Martinho Simões
Quantity | Value | Units | Method | Reference | Comment |
---|---|---|---|---|---|
ΔfH°gas | -1716. ± 26. | kJ/mol | Review | Martinho Simões |

Condensed phase thermochemistry data

Data compiled by: José A. Martinho Simões
Quantity | Value | Units | Method | Reference | Comment |
---|---|---|---|---|---|
ΔfH°solid | -1820. ± 17. | kJ/mol | Review | Martinho Simões |

Phase change data

Data compiled by: José A. Martinho Simões
Quantity | Value | Units | Method | Reference | Comment |
---|---|---|---|---|---|
ΔsubH° | 105. ± 20. | kJ/mol | TD-HFC | Connor, Skinner, et al., 1973 |

Reaction thermochemistry data

Data compiled by: José A. Martinho Simões
Individual Reactions
C12Ir4O12 (cr) = 12 (g) + 4
(cr)
By formula: C12Ir4O12 (cr) = 12CO (g) + 4Ir (cr)
Quantity | Value | Units | Method | Reference | Comment |
---|---|---|---|---|---|
ΔrH° | 494. ± 17. | kJ/mol | TD-HFC | Connor, Skinner, et al., 1973 | Please also see Pedley and Rylance, 1977. |

References

Martinho Simões
Martinho Simões, J.A.,
Private communication (see http://webbook.nist.gov/chemistry/om/). [all data]
Connor, Skinner, et al., 1973
Connor, J.A.; Skinner, H.A.; Virmani, Y.,
High temperature microcalorimetric studies of the thermal decomposition and iodination of polynuclear carbonyls of Fe, Co, Ru, Rh, Re, Os and Ir,
Faraday Symp. Chem. Soc., 1973, 8, 18, https://doi.org/10.1039/fs9730800018
. [all data]
Pedley and Rylance, 1977
Pedley, J.B.; Rylance, J.,
Computer Analysed Thermochemical Data: Organic and Organometallic Compounds, University of Sussex, Brigton, 1977. [all data]