Ir(PEt3)2(Cl)2(CO)(COMe)

Phase change data

Data compiled by: José A. Martinho Simões

Quantity Value Units Method Reference Comment
Δsub71.6 ± 0.8kJ/molN/AYoneda, Lin, et al., 1981

References

Yoneda, Lin, et al., 1981
Yoneda, G.; Lin, S.-M.; Wang, L.-P.; Blake, D.M., J. Am. Chem. Soc., 1981, 103, 5768. [all data]