Rh(acac)[CH2CHCO(O)Me]2

Phase change data

Data compiled by: José A. Martinho Simões

Quantity Value Units Method Reference Comment
Δsub111.7 ± 4.6kJ/molN/AJesse, Ernsting, et al., 1978

References

Jesse, Ernsting, et al., 1978
Jesse, A.C.; Ernsting, J.M.; Stufkens, D.J.; Vrieze, K., Thermochim. Acta, 1978, 25, 69. [all data]