Co4(CO)12
- Formula: C12Co4O12
- Molecular weight: 571.8540

Gas phase thermochemistry data

Data compiled by: José A. Martinho Simões
Quantity | Value | Units | Method | Reference | Comment |
---|---|---|---|---|---|
ΔfH°gas | -1748. ± 15. | kJ/mol | Review | Martinho Simões | |
ΔfH°gas | -1747. ± 14. | kJ/mol | Review | Martinho Simões | |
ΔfH°gas | -1747. ± 11. | kJ/mol | Review | Martinho Simões | Selected data. Average of the values from Connor, Skinner, et al., 1973 |

Condensed phase thermochemistry data

Data compiled by: José A. Martinho Simões
Quantity | Value | Units | Method | Reference | Comment |
---|---|---|---|---|---|
ΔfH°solid | -1844. ± 14. | kJ/mol | Review | Martinho Simões | |
ΔfH°solid | -1843. ± 14. | kJ/mol | Review | Martinho Simões | |
ΔfH°solid | -1843.5 ± 9.8 | kJ/mol | Review | Martinho Simões | Selected data. Average of the values from Connor, Skinner, et al., 1973 |

Phase change data

Data compiled by: José A. Martinho Simões
Quantity | Value | Units | Method | Reference | Comment |
---|---|---|---|---|---|
ΔsubH° | 96.2 ± 4.2 | kJ/mol | TD-HFC | Pilcher and Skinner, 1982 | Please also see Connor, Skinner, et al., 1973. |

Reaction thermochemistry data

Data compiled by: José A. Martinho Simões
Individual Reactions
2 (solution) = C12Co4O12 (solution) + 4
(solution)
By formula: 2C8Co2O8 (solution) = C12Co4O12 (solution) + 4CO (solution)
Quantity | Value | Units | Method | Reference | Comment |
---|---|---|---|---|---|
ΔrH° | 29.49 ± 0.50 | kcal/mol | EqS | Bor and Dietler, 1980 | solvent: Hexane; Temperature range: 378-418 K |
C12Co4O12 (cr) = 12 (g) + 4
(cr)
By formula: C12Co4O12 (cr) = 12CO (g) + 4Co (cr)
Quantity | Value | Units | Method | Reference | Comment |
---|---|---|---|---|---|
ΔrH° | 123.8 ± 3.3 | kcal/mol | TD-HFC | Connor, Skinner, et al., 1973 | |
ΔrH° | 123.4 ± 3.3 | kcal/mol | HAL-HFC | Connor, Skinner, et al., 1973 |

References

Martinho Simões
Martinho Simões, J.A.,
Private communication (see http://webbook.nist.gov/chemistry/om/). [all data]
Connor, Skinner, et al., 1973
Connor, J.A.; Skinner, H.A.; Virmani, Y.,
High temperature microcalorimetric studies of the thermal decomposition and iodination of polynuclear carbonyls of Fe, Co, Ru, Rh, Re, Os and Ir,
Faraday Symp. Chem. Soc., 1973, 8, 18, https://doi.org/10.1039/fs9730800018
. [all data]
Pilcher and Skinner, 1982
Pilcher, G.; Skinner, H.A.,
In The Chemistry of the Metal-Carbon Bond Wiley: New York, Hartley, F. R.; Patai, S., ed(s)., 1982. [all data]