(Ado)B12
- Formula: C72H100CoN18O17P
- Molecular weight: 1579.5818

Reaction thermochemistry data

Data compiled by: José A. Martinho Simões
Individual Reactions
C72H100CoN18O17P (solution) = (solution) +
(solution)
By formula: C72H100CoN18O17P (solution) = C63H88CoN14O14P (solution) + Al (solution)
Quantity | Value | Units | Method | Reference | Comment |
---|---|---|---|---|---|
ΔrH° | 30. ± 4. | kcal/mol | AVG | N/A | Average of 5 out of 6 values; Individual data points |

References

No reference data available.