FeRu2(CO)12
- Formula: C12FeO12Ru2
- Molecular weight: 594.11

Gas phase thermochemistry data

Data compiled by: José A. Martinho Simões
Quantity | Value | Units | Method | Reference | Comment |
---|---|---|---|---|---|
ΔfH°gas | -1789. ± 23. | kJ/mol | Review | Martinho Simões |

Condensed phase thermochemistry data

Data compiled by: José A. Martinho Simões
Quantity | Value | Units | Method | Reference | Comment |
---|---|---|---|---|---|
ΔfH°solid | -1891. ± 10. | kJ/mol | Review | Martinho Simões |

Phase change data

Data compiled by: José A. Martinho Simões
Quantity | Value | Units | Method | Reference | Comment |
---|---|---|---|---|---|
ΔsubH° | 102. ± 20. | kJ/mol | TD-HFC | Baev, Connor, et al., 1981 |

Reaction thermochemistry data

Data compiled by: José A. Martinho Simões
Individual Reactions
C12FeO12Ru2 (cr) = 12 (g) +
(cr) + 2
(cr)
By formula: C12FeO12Ru2 (cr) = 12CO (g) + Fe (cr) + 2Ru (cr)
Quantity | Value | Units | Method | Reference | Comment |
---|---|---|---|---|---|
ΔrH° | 565. ± 10. | kJ/mol | TD-HFC | Baev, Connor, et al., 1981 |

References

Martinho Simões
Martinho Simões, J.A.,
Private communication (see http://webbook.nist.gov/chemistry/om/). [all data]
Baev, Connor, et al., 1981
Baev, A.K.; Connor, J.A.; El-Saied, N.I.; Skinner H.A.,
J. Organometal. Chem., 1981, 213, 151. [all data]