Fe2Ru(CO)12
- Formula: C12Fe2O12Ru
- Molecular weight: 548.88

Gas phase thermochemistry data

Data compiled by: José A. Martinho Simões
Quantity | Value | Units | Method | Reference | Comment |
---|---|---|---|---|---|
ΔfH°gas | -1721. ± 21. | kJ/mol | Review | Martinho Simões |

Phase change data

Data compiled by: José A. Martinho Simões
Quantity | Value | Units | Method | Reference | Comment |
---|---|---|---|---|---|
ΔsubH° | 99. ± 20. | kJ/mol | TD-HFC | Baev, Connor, et al., 1981 |

Reaction thermochemistry data

Data compiled by: José A. Martinho Simões
Individual Reactions
C12Fe2O12Ru (cr) = 12 (g) + 2
(cr) +
(cr)
By formula: C12Fe2O12Ru (cr) = 12CO (g) + 2Fe (cr) + Ru (cr)
Quantity | Value | Units | Method | Reference | Comment |
---|---|---|---|---|---|
ΔrH° | 494. ± 7. | kJ/mol | TD-HFC | Baev, Connor, et al., 1981 |

Condensed phase thermochemistry data

Data compiled by: José A. Martinho Simões

Quantity Value Units Method Reference Comment
Δfsolid-1820.4 ± 7.3kJ/molReviewMartinho Simões

References

Martinho Simões
Martinho Simões, J.A.,
Private communication (see http://webbook.nist.gov/chemistry/om/). [all data]
Baev, Connor, et al., 1981
Baev, A.K.; Connor, J.A.; El-Saied, N.I.; Skinner H.A.,
J. Organometal. Chem., 1981, 213, 151. [all data]