Ru(Cp*)(PMe3)2(OMe)
- Formula: C17H36OP2Ru
- Molecular weight: 419.48

Reaction thermochemistry data

Data compiled by: José A. Martinho Simões
Individual Reactions
C16H34OP2Ru (solution) + (solution) = C17H36OP2Ru (solution) +
(solution)
By formula: C16H34OP2Ru (solution) + CH4O (solution) = C17H36OP2Ru (solution) + H2O (solution)
Quantity | Value | Units | Method | Reference | Comment |
---|---|---|---|---|---|
ΔrH° | 0. | kcal/mol | EST | Bryndza, Fong, et al., 1987 | solvent: Tetrahydrofuran; The reaction enthalpy was identified with the reaction Gibbs energy, since the the entropy is expected to be small Bryndza, Fong, et al., 1987 |

References

Bryndza, Fong, et al., 1987
Bryndza, H.E.; Fong, L.K.; Paciello, R.A.; Tam, W.; Bercaw, J.E.,
J. Am. Chem. Soc., 1987, 109, 1444. [all data]