Fe2(CO)9
- Formula: C9Fe2O9
- Molecular weight: 363.781

Gas phase thermochemistry data

Data compiled by: José A. Martinho Simões
Quantity | Value | Units | Method | Reference | Comment |
---|---|---|---|---|---|
ΔfH°gas | -1335. ± 22. | kJ/mol | Review | Martinho Simões | |
ΔfH°gas | -1333. ± 22. | kJ/mol | Review | Martinho Simões | |
ΔfH°gas | -1334. ± 21. | kJ/mol | Review | Martinho Simões | Selected data. Average of the values from Connor, Skinner, et al., 1973 |

Condensed phase thermochemistry data

Data compiled by: José A. Martinho Simões
Quantity | Value | Units | Method | Reference | Comment |
---|---|---|---|---|---|
ΔfH°solid | -1410.7 ± 4.6 | kJ/mol | Review | Martinho Simões | |
ΔfH°solid | -1408.2 ± 5.1 | kJ/mol | Review | Martinho Simões | |
ΔfH°solid | -1409.5 ± 3.4 | kJ/mol | Review | Martinho Simões | Selected data. Average of the values from Connor, Skinner, et al., 1973 |

Phase change data

Data compiled by: José A. Martinho Simões
Quantity | Value | Units | Method | Reference | Comment |
---|---|---|---|---|---|
ΔsubH° | 75. ± 21. | kJ/mol | TD-HFC | Connor, Skinner, et al., 1973 |

Reaction thermochemistry data

Data compiled by: José A. Martinho Simões
Individual Reactions
By formula: C9Fe2O9 (cr) = 9CO (g) + 2Fe (cr)
Quantity | Value | Units | Method | Reference | Comment |
---|---|---|---|---|---|
ΔrH° | 415.9 ± 4.3 | kJ/mol | TD-HFC | Connor, Skinner, et al., 1973 | |
ΔrH° | 413.4 ± 4.9 | kJ/mol | HAL-HFC | Connor, Skinner, et al., 1973 |

References

Martinho Simões
Martinho Simões, J.A.,
Private communication (see http://webbook.nist.gov/chemistry/om/). [all data]
Connor, Skinner, et al., 1973
Connor, J.A.; Skinner, H.A.; Virmani, Y.,
High temperature microcalorimetric studies of the thermal decomposition and iodination of polynuclear carbonyls of Fe, Co, Ru, Rh, Re, Os and Ir,
Faraday Symp. Chem. Soc., 1973, 8, 18, https://doi.org/10.1039/fs9730800018
. [all data]