Fe(CO)(1,3-C4H6)2
- Formula: C9H12FeO
- Molecular weight: 192.036

Condensed phase thermochemistry data

Data compiled by: José A. Martinho Simões
Quantity | Value | Units | Method | Reference | Comment |
---|---|---|---|---|---|
ΔfH°solid | -24.5 ± 8.4 | kJ/mol | Review | Martinho Simões | The error bars were quoted from Pilcher and Skinner, 1982 |

Phase change data

Data compiled by: José A. Martinho Simões
Quantity | Value | Units | Method | Reference | Comment |
---|---|---|---|---|---|
ΔsubH° | 76.1 ± 4.2 | kJ/mol | HAL-HFC | Brown, Connor, et al., 1976 |

Gas phase thermochemistry data

Data compiled by: José A. Martinho Simões
Quantity | Value | Units | Method | Reference | Comment |
---|---|---|---|---|---|
ΔfH°gas | 12.3 ± 2.2 | kcal/mol | Review | Martinho Simões | The error bars were quoted from Pilcher and Skinner, 1982 |

References

Martinho Simões
Martinho Simões, J.A.,
Private communication (see http://webbook.nist.gov/chemistry/om/). [all data]
Pilcher and Skinner, 1982
Pilcher, G.; Skinner, H.A.,
In The Chemistry of the Metal-Carbon Bond Wiley: New York, Hartley, F. R.; Patai, S., ed(s)., 1982. [all data]
Brown, Connor, et al., 1976
Brown, D.L.S.; Connor, J.A.; Leung, M.L.; Paz-Andrade, M.I.; Skinner, H.A.,
J. Organometal. Chem., 1976, 110, 79. [all data]