Fe(CO)3(C7H10O2)
- Formula: C10H10FeO5
- Molecular weight: 266.028

Phase change data

Data compiled by: José A. Martinho Simões
Quantity | Value | Units | Method | Reference | Comment |
---|---|---|---|---|---|
ΔvapH° | 17.3 ± 1.0 | kcal/mol | HAL-HFC | Brown, Connor, et al., 1976 |

References

Brown, Connor, et al., 1976
Brown, D.L.S.; Connor, J.A.; Leung, M.L.; Paz-Andrade, M.I.; Skinner, H.A.,
J. Organometal. Chem., 1976, 110, 79. [all data]