Mn(CO)5(COPh)
- Formula: C12H5MnO6
- Molecular weight: 300.1025

Gas phase thermochemistry data

Data compiled by: José A. Martinho Simões
Quantity | Value | Units | Method | Reference | Comment |
---|---|---|---|---|---|
ΔfH°gas | -724.7 ± 8.2 | kJ/mol | Review | Martinho Simões | The enthalpy formation relies on -588.9 ± 7.0 kJ/mol for the enthalpy of formation of Mn(CO)5(Ph)(g) |
ΔfH°gas | -723.8 ± 5.8 | kJ/mol | Review | Martinho Simões | The enthalpy formation relies on -385.8 ± 1.7 kJ/mol for the enthalpy of formation of MnBr2(cr) Connor, Zafarani-Moattar, et al., 1982 |
ΔfH°gas | -724.3 ± 5.4 | kJ/mol | Review | Martinho Simões | Selected data. Average of the values from Connor, Zafarani-Moattar, et al., 1982 |

Condensed phase thermochemistry data

Data compiled by: José A. Martinho Simões
Quantity | Value | Units | Method | Reference | Comment |
---|---|---|---|---|---|
ΔfH°solid | -847.7 ± 7.6 | kJ/mol | Review | Martinho Simões | The enthalpy formation relies on -588.9 ± 7.0 kJ/mol for the enthalpy of formation of Mn(CO)5(Ph)(g) |
ΔfH°solid | -846.8 ± 5.0 | kJ/mol | Review | Martinho Simões | The enthalpy formation relies on -385.8 ± 1.7 kJ/mol for the enthalpy of formation of MnBr2(cr) Connor, Zafarani-Moattar, et al., 1982 |
ΔfH°solid | -847.3 ± 4.5 | kJ/mol | Review | Martinho Simões | Selected data. Average of the values from Connor, Zafarani-Moattar, et al., 1982 |

Phase change data

Data compiled by: José A. Martinho Simões
Quantity | Value | Units | Method | Reference | Comment |
---|---|---|---|---|---|
ΔsubH° | 123. ± 3. | kJ/mol | TD-HFC | Connor, Zafarani-Moattar, et al., 1982 |

Reaction thermochemistry data

Data compiled by: José A. Martinho Simões
Individual Reactions
C11H5MnO5 (solution) + (solution) = C12H5MnO6 (solution)
By formula: C11H5MnO5 (solution) + CO (solution) = C12H5MnO6 (solution)
Quantity | Value | Units | Method | Reference | Comment |
---|---|---|---|---|---|
ΔrH° | -45.2 | kJ/mol | EqS | Calderazzo, 1977 | solvent: 2,2'-diethoxydiethyl ether |
C12H5MnO6 (cr) = C11H5MnO5 (g) + (g)
By formula: C12H5MnO6 (cr) = C11H5MnO5 (g) + CO (g)
Quantity | Value | Units | Method | Reference | Comment |
---|---|---|---|---|---|
ΔrH° | 148. ± 3. | kJ/mol | TD-HFC | Connor, Zafarani-Moattar, et al., 1982 |

References

Martinho Simões
Martinho Simões, J.A.,
Private communication (see http://webbook.nist.gov/chemistry/om/). [all data]
Connor, Zafarani-Moattar, et al., 1982
Connor, J.A.; Zafarani-Moattar, M.T.; Bickerton, J.; El-Saied, N.I.; Suradi, S.; Carson, R.; Al Takkhin, G.; Skinner, H.A.,
Organomet., 1982, 1, 1166. [all data]