Mn(CO)5(CH2F)

Reaction thermochemistry data

Data compiled by: José A. Martinho Simões

Individual Reactions

C6H2FMnO5 (g) = C5MnO5 (g) + Fluoromethyl radical (g)

By formula: C6H2FMnO5 (g) = C5MnO5 (g) + CH2F (g)

Quantity Value Units Method Reference Comment
Δr139. ± 15.kJ/molPIMSMartinho Simões and Beauchamp, 1990The reaction enthalpy was derived from the appearance energy of Mn(CO)5(+), 887.7 ± 4.8 kJ/mol, using Mn(CO)5(CH2F) as the neutral precursor, together with the adiabatic ionization energy of Mn(CO)5 radical, 749. ± 14. kJ/mol Martinho Simões and Beauchamp, 1990

References

Martinho Simões and Beauchamp, 1990
Martinho Simões, J.A.; Beauchamp, J.L., Chem. Rev., 1990, 90, 629. [all data]