W(CO)3(PCy3)2(H2O)
- Formula: C39H68O4P2W
- Molecular weight: 846.74

Reaction thermochemistry data

Data compiled by: José A. Martinho Simões
Individual Reactions
C39H68O3P2W (solution) + (solution) = C39H68O4P2W (solution) +
(g)
By formula: C39H68O3P2W (solution) + H2O (solution) = C39H68O4P2W (solution) + H2 (g)
Quantity | Value | Units | Method | Reference | Comment |
---|---|---|---|---|---|
ΔrH° | -2.80 ± 0.1 | kcal/mol | EqS | Kubas, Burns, et al., 1992 | solvent: Tetrahydrofuran; Temperature range: 203-298 K |

References

Kubas, Burns, et al., 1992
Kubas, G.J.; Burns, C.J.; Khalsa, G.R.K.; van der Sluys, L.S.; Kiss, G.; Hoff, C.D.,
Organometallics, 1992, 11, 3390. [all data]