W(CO)4(PCy3)2
- Formula: C40H66O4P2W
- Molecular weight: 856.74

Reaction thermochemistry data

Data compiled by: José A. Martinho Simões
Individual Reactions
C39H68O3P2W (solution) + (solution) = C40H66O4P2W (solution) +
(g)
By formula: C39H68O3P2W (solution) + CO (solution) = C40H66O4P2W (solution) + H2 (g)
Quantity | Value | Units | Method | Reference | Comment |
---|---|---|---|---|---|
ΔrH° | -20.5 ± 0.69 | kcal/mol | RSC | Gonzalez, Zhang, et al., 1988 | solvent: Toluene |
ΔrH° | -22.8 ± 1.0 | kcal/mol | RSC | Gonzalez, Zhang, et al., 1988 | solvent: Tetrahydrofuran |

References

Gonzalez, Zhang, et al., 1988
Gonzalez, A.A.; Zhang, K.; Nolan, S.P.; Lopez de la Vega, R.; Mukerjee, S.L.; Hoff, C.D.,
Organometallics, 1988, 7, 2429. [all data]