W(CO)3(py)3
- Formula: C18H15N3O3W
- Molecular weight: 505.17

Condensed phase thermochemistry data

Data compiled by: José A. Martinho Simões
Quantity | Value | Units | Method | Reference | Comment |
---|---|---|---|---|---|
ΔfH°solid | -262.2 ± 9.0 | kJ/mol | Review | Martinho Simões | The enthalpy of formation relies on -960.3 ± 2.4 kJ/mol for the enthalpy of formation of W(CO)6(cr) |

Phase change data

Data compiled by: José A. Martinho Simões
Quantity | Value | Units | Method | Reference | Comment |
---|---|---|---|---|---|
ΔsubH° | 146. ± 10. | kJ/mol | HFC | Adedeji, Connor, et al., 1978 |

Reaction thermochemistry data

Data compiled by: José A. Martinho Simões
Individual Reactions
(cr) + 3
(g) = C18H15N3O3W (g) + 3
(g)
By formula: C6O6W (cr) + 3C4H4N2 (g) = C18H15N3O3W (g) + 3CO (g)
Quantity | Value | Units | Method | Reference | Comment |
---|---|---|---|---|---|
ΔrH° | -54.7 ± 8.4 | kJ/mol | HFC | Adedeji, Connor, et al., 1978 |

Gas phase thermochemistry data

Data compiled by: José A. Martinho Simões
Quantity | Value | Units | Method | Reference | Comment |
---|---|---|---|---|---|
ΔfH°gas | -27.8 ± 3.2 | kcal/mol | Review | Martinho Simões | The enthalpy of formation relies on -229.5 ± 0.57 kcal/mol for the enthalpy of formation of W(CO)6(cr) |

References

Martinho Simões
Martinho Simões, J.A.,
Private communication (see http://webbook.nist.gov/chemistry/om/). [all data]
Adedeji, Connor, et al., 1978
Adedeji, F.A.; Connor, J.A.; Demain, C.P.; Martinho Simões, J.A.; Skinner, H.A.; Zafarani- Moattar, M.T.,
J. Organometal. Chem., 1978, 149, 333. [all data]