W(CO)4(CC6H4CF3)(Br)

Reaction thermochemistry data

Data compiled by: José A. Martinho Simões

Individual Reactions

C12H4F3IO4W (g) + Bromine (g) = C12H4BrF3O4W (g) + Iodine atom (g)

By formula: C12H4F3IO4W (g) + Br (g) = C12H4BrF3O4W (g) + I (g)

Quantity Value Units Method Reference Comment
Δr-55.kJ/molEqSFischer and Seitz, 1984The reaction enthalpy relies on a single measurement of the equilibrium constant in 1,1,2-trichloroethane (at 263 K) for the reaction W(CO)4(CC6H4CF3)(I)(solution) + Br(-)(solution) = W(CO)4(CC6H4CF3)(Br)(solution) + I(-)(solution), and on solvation and electron affinity data. It assumes that the reaction entropy is negligible Fischer and Seitz, 1984

References

Fischer and Seitz, 1984
Fischer, H.; Seitz, F., J. Organometal. Chem., 1984, 268, 247. [all data]