W(CO)4(CPh)(I)
- Formula: C11H5IO4W
- Molecular weight: 511.90

Reaction thermochemistry data

Data compiled by: José A. Martinho Simões
Individual Reactions
C11H5IO4W (g) + (g) = C11H5BrO4W (g) +
(g)
By formula: C11H5IO4W (g) + Br (g) = C11H5BrO4W (g) + I (g)
Quantity | Value | Units | Method | Reference | Comment |
---|---|---|---|---|---|
ΔrH° | -13. | kcal/mol | EqS | Fischer and Seitz, 1984 | The reaction enthalpy relies on a single measurement of the equilibrium constant in 1,1,2-trichloroethane (at 263 K) for the reaction W(CO)4(CPh)(I)(solution) + Br(-)(solution) = W(CO)4(CPh)(Br)(solution) + I(-)(solution), and on solvation and electron affinity data. It assumes that the reaction entropy is negligible Fischer and Seitz, 1984 |

References

Fischer and Seitz, 1984
Fischer, H.; Seitz, F.,
J. Organometal. Chem., 1984, 268, 247. [all data]