W(CO)4(MeCN)2
- Formula: C8H6N2O4W
- Molecular weight: 377.98

Condensed phase thermochemistry data

Data compiled by: José A. Martinho Simões
Quantity | Value | Units | Method | Reference | Comment |
---|---|---|---|---|---|
ΔfH°solid | -587.2 ± 4.7 | kJ/mol | Review | Martinho Simões | The enthalpy of formation relies on -883.9 ± 2.7 kJ/mol for the enthalpy of formation of W(CO)6(g) |

Phase change data

Data compiled by: José A. Martinho Simões
Quantity | Value | Units | Method | Reference | Comment |
---|---|---|---|---|---|
ΔsubH° | 131.0 ± 6.0 | kJ/mol | DSC | Cavell, Ernsting, et al., 1980 |

Gas phase thermochemistry data

Data compiled by: José A. Martinho Simões
Quantity | Value | Units | Method | Reference | Comment |
---|---|---|---|---|---|
ΔfH°gas | -456.2 ± 7.6 | kJ/mol | Review | Martinho Simões | The enthalpy of formation relies on -883.9 ± 2.7 kJ/mol for the enthalpy of formation of W(CO)6(g) |

Reaction thermochemistry data

Data compiled by: José A. Martinho Simões
Individual Reactions
C8H6N2O4W (cr) + 2 (g) =
(g) + 2
(g)
By formula: C8H6N2O4W (cr) + 2CO (g) = C6O6W (g) + 2C2H3N (g)
Quantity | Value | Units | Method | Reference | Comment |
---|---|---|---|---|---|
ΔrH° | 17.3 ± 0.91 | kcal/mol | DSC | Bleijerveld and Vrieze, 1976 | Please also see Bleyerveld, Höhle, et al., 1975. |

References

Martinho Simões
Martinho Simões, J.A.,
Private communication (see http://webbook.nist.gov/chemistry/om/). [all data]
Cavell, Ernsting, et al., 1980
Cavell, K.J.; Ernsting, J.M.; Stufkens, D.J.,
Thermochim. Acta, 1980, 42, 343. [all data]