W(CO)5(Xe)

Reaction thermochemistry data

Data compiled by: José A. Martinho Simões

Individual Reactions

C5O5WXe (solution) = C5O5W (solution) + Xenon (solution)

By formula: C5O5WXe (solution) = C5O5W (solution) + Xe (solution)

Quantity Value Units Method Reference Comment
Δr35.1 ± 0.8kJ/molKinSWeiller, 1992solvent: Liquid Xenon; Temperature range: 173-198 K

C5O5WXe (g) = C5O5W (g) + Xenon (g)

By formula: C5O5WXe (g) = C5O5W (g) + Xe (g)

Quantity Value Units Method Reference Comment
Δr34.3 ± 4.2kJ/molKinGWells and Weitz, 1992The reaction enthalpy relies on 31.8 ± 4.2 kJ/mol for the activation energy and on the assumption of a negligible barrier for product recombination Wells and Weitz, 1992

References

Weiller, 1992
Weiller, B.H., J. Am. Chem. Soc., 1992, 114, 10910. [all data]

Wells and Weitz, 1992
Wells, J.R.; Weitz, E., J. Am. Chem. Soc., 1992, 114, 2783. [all data]