W(CO)5[P(OPh)3]
- Formula: C23H15O8PW
- Molecular weight: 634.17

Phase change data

Data compiled by: José A. Martinho Simões
Quantity | Value | Units | Method | Reference | Comment |
---|---|---|---|---|---|
ΔsubH° | 120.2 ± 6.6 | kJ/mol | N/A | Boxhoorn, Ernsting, et al., 1980 |

References

Boxhoorn, Ernsting, et al., 1980
Boxhoorn, G.; Ernsting, J.M.; Stufkens, D.J.; Oskam, A.,
Thermochim. Acta, 1980, 42, 315. [all data]