W(CO)5(C4H4N2)
- Formula: C9H4N2O5W
- Molecular weight: 403.98

Condensed phase thermochemistry data

Data compiled by: José A. Martinho Simões
Quantity | Value | Units | Method | Reference | Comment |
---|---|---|---|---|---|
ΔfH°solid | -641.3 ± 5.0 | kJ/mol | Review | Martinho Simões | The enthalpy of formation relies on -883.9 ± 2.7 kJ/mol for the enthalpy of formation of W(CO)6(g) |

Phase change data

Data compiled by: José A. Martinho Simões
Quantity | Value | Units | Method | Reference | Comment |
---|---|---|---|---|---|
ΔsubH° | 108.4 ± 1.3 | kJ/mol | DSC | Daamen, Ernsting, et al., 1979 |

Gas phase thermochemistry data

Data compiled by: José A. Martinho Simões
Quantity | Value | Units | Method | Reference | Comment |
---|---|---|---|---|---|
ΔfH°gas | -532.9 ± 5.2 | kJ/mol | Review | Martinho Simões | The enthalpy of formation relies on -883.9 ± 2.7 kJ/mol for the enthalpy of formation of W(CO)6(g) |

References

Martinho Simões
Martinho Simões, J.A.,
Private communication (see http://webbook.nist.gov/chemistry/om/). [all data]
Daamen, Ernsting, et al., 1979
Daamen, H.; Ernsting, J.M.; Oskam, A.,
Thermochim. Acta, 1979, 33, 217. [all data]