W(CO)5(pz)
- Formula: C8H4N2O5W
- Molecular weight: 391.97

Gas phase thermochemistry data

Data compiled by: José A. Martinho Simões
Quantity | Value | Units | Method | Reference | Comment |
---|---|---|---|---|---|
ΔfH°gas | -539.5 ± 7.0 | kJ/mol | Review | Martinho Simões | The enthalpy of formation relies on -883.9 ± 2.7 kJ/mol for the enthalpy of formation of W(CO)6(g) |

Condensed phase thermochemistry data

Data compiled by: José A. Martinho Simões
Quantity | Value | Units | Method | Reference | Comment |
---|---|---|---|---|---|
ΔfH°solid | -652.0 ± 6.6 | kJ/mol | Review | Martinho Simões | The enthalpy of formation relies on -883.9 ± 2.7 kJ/mol for the enthalpy of formation of W(CO)6(g) |

Phase change data

Data compiled by: José A. Martinho Simões
Quantity | Value | Units | Method | Reference | Comment |
---|---|---|---|---|---|
ΔsubH° | 26.89 ± 0.57 | kcal/mol | DSC | Daamen, Ernsting, et al., 1979 |

References

Martinho Simões
Martinho Simões, J.A.,
Private communication (see http://webbook.nist.gov/chemistry/om/). [all data]