W(CO)5(MeCN)
- Formula: C7H3NO5W
- Molecular weight: 364.94

Phase change data

Data compiled by: José A. Martinho Simões
Quantity | Value | Units | Method | Reference | Comment |
---|---|---|---|---|---|
ΔsubH° | 98.1 ± 2.0 | kJ/mol | DSC | Cavell, Ernsting, et al., 1980 |

Reaction thermochemistry data

Data compiled by: José A. Martinho Simões
Individual Reactions
C7H3NO5W (cr) + (g) =
(g) +
(g)
By formula: C7H3NO5W (cr) + CO (g) = C6O6W (g) + C2H3N (g)
Quantity | Value | Units | Method | Reference | Comment |
---|---|---|---|---|---|
ΔrH° | 70.7 ± 2.5 | kJ/mol | DSC | Bleijerveld and Vrieze, 1976 | Please also see Bleyerveld, Höhle, et al., 1975. |

Condensed phase thermochemistry data

Data compiled by: José A. Martinho Simões
Quantity | Value | Units | Method | Reference | Comment |
---|---|---|---|---|---|
ΔfH°solid | -770.1 ± 3.7 | kJ/mol | Review | Martinho Simões | The enthalpy of formation relies on -883.9 ± 2.7 kJ/mol for the enthalpy of formation of W(CO)6(g) |

Gas phase thermochemistry data

Data compiled by: José A. Martinho Simões
Quantity | Value | Units | Method | Reference | Comment |
---|---|---|---|---|---|
ΔfH°gas | -672.0 ± 4.2 | kJ/mol | Review | Martinho Simões | The enthalpy of formation relies on -883.9 ± 2.7 kJ/mol for the enthalpy of formation of W(CO)6(g) |

References

Cavell, Ernsting, et al., 1980
Cavell, K.J.; Ernsting, J.M.; Stufkens, D.J.,
Thermochim. Acta, 1980, 42, 343. [all data]
Bleijerveld and Vrieze, 1976
Bleijerveld, R.H.T.; Vrieze, K.,
Inorg. Chim. Acta, 1976, 19, 195. [all data]
Bleyerveld, Höhle, et al., 1975
Bleyerveld, R.H.T.; Höhle, Th.; Vrieze, K.,
J. Organometal. Chem., 1975, 281, 284. [all data]