W(CO)5(OCMe2)

Reaction thermochemistry data

Data compiled by: José A. Martinho Simões

Individual Reactions

Tungsten hexacarbonyl (solution) + Acetone (solution) = C8H6O6W (solution) + Carbon monoxide (solution)

By formula: C6O6W (solution) + C3H6O (solution) = C8H6O6W (solution) + CO (solution)

Quantity Value Units Method Reference Comment
Δr74.9 ± 5.9kJ/molPCNakashima and Adamson, 1982solvent: Acetone

References

Nakashima and Adamson, 1982
Nakashima, M.; Adamson, A.W., J. Phys. Chem., 1982, 86, 2905. [all data]