W(Cp)2(I)2
- Formula: C10H10I2W
- Molecular weight: 567.84

Condensed phase thermochemistry data

Data compiled by: José A. Martinho Simões
Quantity | Value | Units | Method | Reference | Comment |
---|---|---|---|---|---|
ΔfH°solid | 27.96 ± 0.79 | kcal/mol | Review | Martinho Simões | |
ΔfH°solid | 16.5 ± 2.4 | kcal/mol | Review | Martinho Simões | The enthalpy of formation relies on the enthalpy of solution of HI in toluene, -7.07 ± 0.55 kcal/mol Calado, Dias, et al., 1979, and on the enthalpy of formation of W(Cp)2(H)2(cr), 54.1 ± 2.1 kcal/mol |
Quantity | Value | Units | Method | Reference | Comment |
ΔcH°solid | -1511.5 ± 0.69 | kcal/mol | CC-SB | Tel'noi, Rabinovich, et al., 1976 | Please also see Tel'noi and Rabinovich, 1977. |

Phase change data

Data compiled by: José A. Martinho Simões
Quantity | Value | Units | Method | Reference | Comment |
---|---|---|---|---|---|
ΔsubH° | 25.0 ± 1.0 | kcal/mol | CC-SB | Tel'noi, Rabinovich, et al., 1976 |

Gas phase thermochemistry data

Data compiled by: José A. Martinho Simões

Quantity Value Units Method Reference Comment
Δfgas221.6 ± 5.3kJ/molReviewMartinho Simões
Δfgas174. ± 11.kJ/molReviewMartinho SimõesThe enthalpy of formation relies on the enthalpy of solution of HI in toluene, -29.6 ± 2.3 kJ/mol Calado, Dias, et al., 1979, and on the enthalpy of formation of W(Cp)2(H)2(cr), 226.2 ± 8.6 kJ/mol

Reaction thermochemistry data

Data compiled by: José A. Martinho Simões

Individual Reactions

C10H12W (cr) + 2Iodine (cr) = C10H10I2W (cr) + 2Hydrogen iodide (g)

By formula: C10H12W (cr) + 2I2 (cr) = C10H10I2W (cr) + 2HI (g)

Quantity Value Units Method Reference Comment
Δr-24.9 ± 1.3kcal/molRSCCalado, Dias, et al., 1979

C10H11IW (cr) + Iodine (cr) = C10H10I2W (cr) + Hydrogen iodide (g)

By formula: C10H11IW (cr) + I2 (cr) = C10H10I2W (cr) + HI (g)

Quantity Value Units Method Reference Comment
Δr-20.2 ± 0.98kcal/molRSCCalhorda, Dias, et al., 1987

References

Martinho Simões
Martinho Simões, J.A.,
Private communication (see http://webbook.nist.gov/chemistry/om/). [all data]
Calado, Dias, et al., 1979
Calado, J.C.G.; Dias, A.R.; Martinho Simões, J.A.; Ribeiro da Silva, M.A.V.,
Rev. Port. Quím., 1979, 21, 129. [all data]
Tel'noi, Rabinovich, et al., 1976
Tel'noi, V.I.; Rabinovich, I.B.; Kir'yanov, K.V.; Smirnov, A.S.,
Dokl. Akad. Nauk SSSR, 1976, 231, 733. [all data]
Tel'noi and Rabinovich, 1977
Tel'noi, V.I.; Rabinovich, I.B.,
Russ. Chem. Rev., 1977, 46, 689. [all data]