W(Cp)2(Br)2
- Formula: C10H10Br2W
- Molecular weight: 473.83

Gas phase thermochemistry data

Data compiled by: José A. Martinho Simões
Quantity | Value | Units | Method | Reference | Comment |
---|---|---|---|---|---|
ΔfH°gas | 31.5 ± 3.6 | kcal/mol | Review | Martinho Simões | The enthalpy of formation relies on 54.1 ± 2.1 kcal/mol for the enthalpy of formation of W(Cp)2(H)2(cr) |

Reaction thermochemistry data

Data compiled by: José A. Martinho Simões
Individual Reactions
C10H12W (cr) + 2 (cr) = C10H10Br2W (cr) + 2
(l)
By formula: C10H12W (cr) + 2CBr4 (cr) = C10H10Br2W (cr) + 2CHBr3 (l)
Quantity | Value | Units | Method | Reference | Comment |
---|---|---|---|---|---|
ΔrH° | -72.30 ± 0.53 | kcal/mol | RSC | Calado, Dias, et al., 1980 |

Condensed phase thermochemistry data

Data compiled by: José A. Martinho Simões
Quantity | Value | Units | Method | Reference | Comment |
---|---|---|---|---|---|
ΔfH°solid | 6.5 ± 3.4 | kcal/mol | Review | Martinho Simões | The enthalpy of formation relies on 54.1 ± 2.1 kcal/mol for the enthalpy of formation of W(Cp)2(H)2(cr) |

Phase change data

Data compiled by: José A. Martinho Simões
Quantity | Value | Units | Method | Reference | Comment |
---|---|---|---|---|---|
ΔsubH° | 25.0 ± 1.0 | kcal/mol | RSC | Calado, Dias, et al., 1980 |

References

Martinho Simões
Martinho Simões, J.A.,
Private communication (see http://webbook.nist.gov/chemistry/om/). [all data]
Calado, Dias, et al., 1980
Calado, J.C.G.; Dias, A.R.; Martinho Simões, J.A.,
J. Organometal. Chem., 1980, 195, 203. [all data]