W(Cp)2(Cl)2
- Formula: C10H10Cl2W
- Molecular weight: 384.93

Gas phase thermochemistry data

Data compiled by: José A. Martinho Simões
Quantity | Value | Units | Method | Reference | Comment |
---|---|---|---|---|---|
ΔfH°gas | 7.7 ± 1.2 | kcal/mol | Review | Martinho Simões | |
ΔfH°gas | 9.9 ± 2.0 | kcal/mol | Review | Martinho Simões | Selected data |

Reaction thermochemistry data

Data compiled by: José A. Martinho Simões
Individual Reactions
C12H16W (cr) + 2( • 5.55
) (solution) = C10H10Cl2W (cr) + 2
(g)
By formula: C12H16W (cr) + 2(HCl • 5.55H2O) (solution) = C10H10Cl2W (cr) + 2CH4 (g)
Quantity | Value | Units | Method | Reference | Comment |
---|---|---|---|---|---|
ΔrH° | -40.61 ± 0.55 | kcal/mol | RSC | Calado, Dias, et al., 1978 | Please also see Calhorda, Dias, et al., 1987. |
C14H10F6O4W (cr) + 2( • 4.40
) (solution) = C10H10Cl2W (cr) + 2
(l)
By formula: C14H10F6O4W (cr) + 2(HCl • 4.40H2O) (solution) = C10H10Cl2W (cr) + 2C2HF3O2 (l)
Quantity | Value | Units | Method | Reference | Comment |
---|---|---|---|---|---|
ΔrH° | 7.62 ± 0.45 | kcal/mol | RSC | Calado, Dias, et al., 1981 | Please also see Calhorda, Carrondo, et al., 1986. |
C10H12W (cr) + 2 (l) = C10H10Cl2W (cr) + 2
(l)
By formula: C10H12W (cr) + 2CCl4 (l) = C10H10Cl2W (cr) + 2CHCl3 (l)
Quantity | Value | Units | Method | Reference | Comment |
---|---|---|---|---|---|
ΔrH° | -71.96 ± 0.81 | kcal/mol | RSC | Calado, Dias, et al., 1979 |

Condensed phase thermochemistry data

Data compiled by: José A. Martinho Simões
Quantity | Value | Units | Method | Reference | Comment |
---|---|---|---|---|---|
ΔfH°solid | -17.3 ± 0.69 | kcal/mol | Review | Martinho Simões | |
ΔfH°solid | -15.1 ± 1.7 | kcal/mol | Review | Martinho Simões | Selected data |
Quantity | Value | Units | Method | Reference | Comment |
ΔcH°solid | -1479.8 ± 1.7 | kcal/mol | CC-RB | Minas da Piedade, 1988 | Please also see Minas da Piedade, Shaofeng, et al., 1987. |
ΔcH°solid | -1477.4 ± 0.60 | kcal/mol | CC-SB | Tel'noi, Rabinovich, et al., 1976 | Please also see Tel'noi and Rabinovich, 1977. |

Phase change data

Data compiled by: José A. Martinho Simões
Quantity | Value | Units | Method | Reference | Comment |
---|---|---|---|---|---|
ΔsubH° | 25.0 ± 1.0 | kcal/mol | CC-SB | Tel'noi, Rabinovich, et al., 1976 |

References

Martinho Simões
Martinho Simões, J.A.,
Private communication (see http://webbook.nist.gov/chemistry/om/). [all data]
Calado, Dias, et al., 1978
Calado, J.C.G.; Dias, A.R.; Martinho Simões, J.A.; Ribeiro da Silva, M.A.V.,
J. Chem. Soc., Chem. Commun., 1978, 737.. [all data]
Calhorda, Dias, et al., 1987
Calhorda, M.J.; Dias, A.R.; Minas da Piedade M.E.; Salema, M.S.; Martinho Simões J.A.,
Organometallics, 1987, 6, 734. [all data]
Calado, Dias, et al., 1981
Calado, J.C.G.; Dias, A.R.; Salema, M.S.; Martinho Simões, J.A.,
J. Chem. Soc., Dalton Trans., 1981, 1174.. [all data]
Calhorda, Carrondo, et al., 1986
Calhorda, M.J.; Carrondo, M.A.A.F.C.T.; Dias, A.R.; Domingos, A.M.T.S.; Martinho Simões, J.A.; Teixeira, C.,
Organometallics, 1986, 5, 660. [all data]
Calado, Dias, et al., 1979
Calado, J.C.G.; Dias, A.R.; Martinho Simões, J.A.; Ribeiro da Silva, M.A.V.,
J. Organometal. Chem., 1979, 174, 77. [all data]