W(Cp)2(I)(H)
- Formula: C10H11IW
- Molecular weight: 441.94

Gas phase thermochemistry data

Data compiled by: José A. Martinho Simões
Quantity | Value | Units | Method | Reference | Comment |
---|---|---|---|---|---|
ΔfH°gas | 280. ± 12. | kJ/mol | Review | Martinho Simões | The enthalpy of formation relies on the enthalpy of solution of HI in toluene, -29.6 ± 2.3 kJ/mol Calado, Dias, et al., 1979, and on the enthalpy of formation of W(Cp)2(I)2(cr), 69. ± 10. kJ/mol |

Condensed phase thermochemistry data

Data compiled by: José A. Martinho Simões
Quantity | Value | Units | Method | Reference | Comment |
---|---|---|---|---|---|
ΔfH°solid | 180. ± 11. | kJ/mol | Review | Martinho Simões | The enthalpy of formation relies on the enthalpy of solution of HI in toluene, -29.6 ± 2.3 kJ/mol Calado, Dias, et al., 1979, and on the enthalpy of formation of W(Cp)2(I)2(cr), 69. ± 10. kJ/mol |

Phase change data

Data compiled by: José A. Martinho Simões
Quantity | Value | Units | Method | Reference | Comment |
---|---|---|---|---|---|
ΔsubH° | 100. ± 5. | kJ/mol | RSC | Calhorda, Dias, et al., 1987 |

References

Martinho Simões
Martinho Simões, J.A.,
Private communication (see http://webbook.nist.gov/chemistry/om/). [all data]
Calado, Dias, et al., 1979
Calado, J.C.G.; Dias, A.R.; Martinho Simões, J.A.; Ribeiro da Silva, M.A.V.,
Rev. Port. Quím., 1979, 21, 129. [all data]