W(Cp)2(SPh)2
- Formula: C22H20S2W
- Molecular weight: 532.36

Phase change data

Data compiled by: José A. Martinho Simões
Quantity | Value | Units | Method | Reference | Comment |
---|---|---|---|---|---|
ΔsubH° | 99. ± 10. | kJ/mol | RSC | Calhorda, Carrondo, et al., 1988 |

Gas phase thermochemistry data

Data compiled by: José A. Martinho Simões
Quantity | Value | Units | Method | Reference | Comment |
---|---|---|---|---|---|
ΔfH°gas | 102.1 ± 3.2 | kcal/mol | Review | Martinho Simões | The enthalpy of formation relies on -15.1 ± 1.7 kcal/mol for the enthalpy of formation of W(Cp)2(Cl)2(cr) |

Condensed phase thermochemistry data

Data compiled by: José A. Martinho Simões
Quantity | Value | Units | Method | Reference | Comment |
---|---|---|---|---|---|
ΔfH°solid | 78.4 ± 2.1 | kcal/mol | Review | Martinho Simões | The enthalpy of formation relies on -15.1 ± 1.7 kcal/mol for the enthalpy of formation of W(Cp)2(Cl)2(cr) |

References

Calhorda, Carrondo, et al., 1988
Calhorda, M.J.; Carrondo, M.A.A.F. de C.T.; Dias, A.R.; Frazão, C.F.; Hursthouse, M.B.; Martinho Simões, J.A.; Teixeira, C.,
Inorg. Chem., 1988, 27, 2513. [all data]