W(Cp)2(SPr)2
- Formula: C16H24S2W
- Molecular weight: 464.33

Gas phase thermochemistry data

Data compiled by: José A. Martinho Simões
Quantity | Value | Units | Method | Reference | Comment |
---|---|---|---|---|---|
ΔfH°gas | 111. ± 13. | kJ/mol | Review | Martinho Simões | The enthalpy of formation relies on -63.1 ± 7.2 kJ/mol for the enthalpy of formation of W(Cp)2(Cl)2(cr) |

Condensed phase thermochemistry data

Data compiled by: José A. Martinho Simões
Quantity | Value | Units | Method | Reference | Comment |
---|---|---|---|---|---|
ΔfH°solid | 17.0 ± 8.8 | kJ/mol | Review | Martinho Simões | The enthalpy of formation relies on -63.1 ± 7.2 kJ/mol for the enthalpy of formation of W(Cp)2(Cl)2(cr) |

Phase change data

Data compiled by: José A. Martinho Simões
Quantity | Value | Units | Method | Reference | Comment |
---|---|---|---|---|---|
ΔsubH° | 94. ± 10. | kJ/mol | RSC | Calhorda, Dias, et al., 1984 |

References

Martinho Simões
Martinho Simões, J.A.,
Private communication (see http://webbook.nist.gov/chemistry/om/). [all data]