W(Cp)2(OOCPh)2
- Formula: C24H20O4W
- Molecular weight: 556.25

Condensed phase thermochemistry data

Data compiled by: José A. Martinho Simões
Quantity | Value | Units | Method | Reference | Comment |
---|---|---|---|---|---|
ΔfH°solid | -456.0 ± 7.7 | kJ/mol | Review | Martinho Simões | The enthalpy of formation relies on -63.1 ± 7.2 kJ/mol for the enthalpy of formation of W(Cp)2(Cl)2(cr) |

Phase change data

Data compiled by: José A. Martinho Simões
Quantity | Value | Units | Method | Reference | Comment |
---|---|---|---|---|---|
ΔsubH° | 98. ± 10. | kJ/mol | RSC | Calado, Dias, et al., 1981 |

Gas phase thermochemistry data

Data compiled by: José A. Martinho Simões
Quantity | Value | Units | Method | Reference | Comment |
---|---|---|---|---|---|
ΔfH°gas | -358. ± 13. | kJ/mol | Review | Martinho Simões | The enthalpy of formation relies on -63.1 ± 7.2 kJ/mol for the enthalpy of formation of W(Cp)2(Cl)2(cr) |

References

Martinho Simões
Martinho Simões, J.A.,
Private communication (see http://webbook.nist.gov/chemistry/om/). [all data]
Calado, Dias, et al., 1981
Calado, J.C.G.; Dias, A.R.; Salema, M.S.; Martinho Simões, J.A.,
J. Chem. Soc., Dalton Trans., 1981, 1174.. [all data]