Mo2(OOCMe)2(acac)2
- Formula: C14H20Mo2O8
- Molecular weight: 508.22

Phase change data

Data compiled by: José A. Martinho Simões
Quantity | Value | Units | Method | Reference | Comment |
---|---|---|---|---|---|
ΔsubH° | 163.0 ± 5.0 | kJ/mol | RSC | Pilcher and Skinner, 1982 |

Gas phase thermochemistry data

Data compiled by: José A. Martinho Simões

Quantity Value Units Method Reference Comment
Δfgas-1646. ± 11.kJ/molReviewMartinho Simões

References

Pilcher and Skinner, 1982
Pilcher, G.; Skinner, H.A.,
In The Chemistry of the Metal-Carbon Bond Wiley: New York, Hartley, F. R.; Patai, S., ed(s)., 1982. [all data]