Mo2(mhp)2(OOCMe)2

Condensed phase thermochemistry data

Data compiled by: José A. Martinho Simões

Quantity Value Units Method Reference Comment
Δfsolid-326.4 ± 3.2kcal/molReviewMartinho Simões

References

Martinho Simões
Martinho Simões, J.A., Private communication (see http://webbook.nist.gov/chemistry/om/). [all data]