Mo(CO)3(pip)3
- Formula: C18H33MoN3O3
- Molecular weight: 435.43

Gas phase thermochemistry data

Data compiled by: José A. Martinho Simões
Quantity | Value | Units | Method | Reference | Comment |
---|---|---|---|---|---|
ΔfH°gas | -745. ± 23. | kJ/mol | Review | Martinho Simões | The enthalpy of formation relies on -915.3 ± 2.1 kJ/mol for the enthalpy of formation of Mo(CO)6(g) |

Phase change data

Data compiled by: José A. Martinho Simões
Quantity | Value | Units | Method | Reference | Comment |
---|---|---|---|---|---|
ΔsubH° | 118. ± 10. | kJ/mol | DSC | Daamen, van der Poel, et al., 1979 |

Condensed phase thermochemistry data

Data compiled by: José A. Martinho Simões
Quantity | Value | Units | Method | Reference | Comment |
---|---|---|---|---|---|
ΔfH°solid | -863. ± 20. | kJ/mol | Review | Martinho Simões | The enthalpy of formation relies on -915.3 ± 2.1 kJ/mol for the enthalpy of formation of Mo(CO)6(g) |

References

Martinho Simões
Martinho Simões, J.A.,
Private communication (see http://webbook.nist.gov/chemistry/om/). [all data]
Daamen, van der Poel, et al., 1979
Daamen, H.; van der Poel, H.; Stufkens, D.J.; Oskam, A.,
Thermochim. Acta, 1979, 34, 69. [all data]