Mo(CO)3(py)3
- Formula: C18H15MoN3O3
- Molecular weight: 417.29

Condensed phase thermochemistry data

Data compiled by: José A. Martinho Simões
Quantity | Value | Units | Method | Reference | Comment |
---|---|---|---|---|---|
ΔfH°solid | -286.7 ± 7.5 | kJ/mol | Review | Martinho Simões | The enthalpy of formation relies on -989.1 ± 1.8 kJ/mol for the enthalpy of formation of Mo(CO)6(cr) |

Phase change data

Data compiled by: José A. Martinho Simões
Quantity | Value | Units | Method | Reference | Comment |
---|---|---|---|---|---|
ΔsubH° | 142. ± 10. | kJ/mol | HFC | Adedeji, Connor, et al., 1978 |

Gas phase thermochemistry data

Data compiled by: José A. Martinho Simões
Quantity | Value | Units | Method | Reference | Comment |
---|---|---|---|---|---|
ΔfH°gas | -145. ± 13. | kJ/mol | Review | Martinho Simões | The enthalpy of formation relies on -989.1 ± 1.8 kJ/mol for the enthalpy of formation of Mo(CO)6(cr) |

Reaction thermochemistry data

Data compiled by: José A. Martinho Simões
Individual Reactions
C8H6MoO3 (solution) + 3 (solution) = C18H15MoN3O3 (solution) +
(solution)
By formula: C8H6MoO3 (solution) + 3C4H4N2 (solution) = C18H15MoN3O3 (solution) + C5H6 (solution)
Quantity | Value | Units | Method | Reference | Comment |
---|---|---|---|---|---|
ΔrH° | -16.7 ± 0.69 | kcal/mol | RSC | Nolan, Hoff, et al., 1985 | solvent: Pyridine; Reaction temperature: 323 K |
(cr) + 3
(g) = C18H15MoN3O3 (cr) + 3
(g)
By formula: C6MoO6 (cr) + 3C4H4N2 (g) = C18H15MoN3O3 (cr) + 3CO (g)
Quantity | Value | Units | Method | Reference | Comment |
---|---|---|---|---|---|
ΔrH° | -12.0 ± 1.7 | kcal/mol | HFC | Adedeji, Connor, et al., 1978 |

References

Martinho Simões
Martinho Simões, J.A.,
Private communication (see http://webbook.nist.gov/chemistry/om/). [all data]
Adedeji, Connor, et al., 1978
Adedeji, F.A.; Connor, J.A.; Demain, C.P.; Martinho Simões, J.A.; Skinner, H.A.; Zafarani- Moattar, M.T.,
J. Organometal. Chem., 1978, 149, 333. [all data]