Mo(CO)3(MeCN)3
- Formula: C9H9MoN3O3
- Molecular weight: 303.15

Gas phase thermochemistry data

Data compiled by: José A. Martinho Simões
Quantity | Value | Units | Method | Reference | Comment |
---|---|---|---|---|---|
ΔfH°gas | -299. ± 10. | kJ/mol | Review | Martinho Simões |

Condensed phase thermochemistry data

Data compiled by: José A. Martinho Simões
Quantity | Value | Units | Method | Reference | Comment |
---|---|---|---|---|---|
ΔfH°solid | -410.4 ± 9.5 | kJ/mol | Review | Martinho Simões |

Phase change data

Data compiled by: José A. Martinho Simões
Quantity | Value | Units | Method | Reference | Comment |
---|---|---|---|---|---|
ΔsubH° | 111.3 ± 3.0 | kJ/mol | HAL-HFC | Cavell, Ernsting, et al., 1980 |

Reaction thermochemistry data

Data compiled by: José A. Martinho Simões
Individual Reactions
C9H9MoN3O3 (cr) = 3 (g) +
(cr) + 3
(g)
By formula: C9H9MoN3O3 (cr) = 3CO (g) + Mo (cr) + 3C2H3N (g)
Quantity | Value | Units | Method | Reference | Comment |
---|---|---|---|---|---|
ΔrH° | 300.8 ± 9.4 | kJ/mol | HAL-HFC | Adedeji, Connor, et al., 1978 |

References

Martinho Simões
Martinho Simões, J.A.,
Private communication (see http://webbook.nist.gov/chemistry/om/). [all data]
Cavell, Ernsting, et al., 1980
Cavell, K.J.; Ernsting, J.M.; Stufkens, D.J.,
Thermochim. Acta, 1980, 42, 343. [all data]
Adedeji, Connor, et al., 1978
Adedeji, F.A.; Connor, J.A.; Demain, C.P.; Martinho Simões, J.A.; Skinner, H.A.; Zafarani- Moattar, M.T.,
J. Organometal. Chem., 1978, 149, 333. [all data]