Mo(CO)5(pip)
- Formula: C10H11MoNO5
- Molecular weight: 321.16

Condensed phase thermochemistry data

Data compiled by: José A. Martinho Simões
Quantity | Value | Units | Method | Reference | Comment |
---|---|---|---|---|---|
ΔfH°solid | -960.0 ± 8.3 | kJ/mol | Review | Martinho Simões | The enthalpy of formation relies on -915.3 ± 2.1 kJ/mol for the enthalpy of formation of Mo(CO)6(g) |

Phase change data

Data compiled by: José A. Martinho Simões
Quantity | Value | Units | Method | Reference | Comment |
---|---|---|---|---|---|
ΔsubH° | 94.5 ± 2.9 | kJ/mol | DSC | Daamen, Ernsting, et al., 1979 |

Gas phase thermochemistry data

Data compiled by: José A. Martinho Simões
Quantity | Value | Units | Method | Reference | Comment |
---|---|---|---|---|---|
ΔfH°gas | -206.9 ± 2.1 | kcal/mol | Review | Martinho Simões | The enthalpy of formation relies on -218.8 ± 0.50 kcal/mol for the enthalpy of formation of Mo(CO)6(g) |

References

Martinho Simões
Martinho Simões, J.A.,
Private communication (see http://webbook.nist.gov/chemistry/om/). [all data]
Daamen, Ernsting, et al., 1979
Daamen, H.; Ernsting, J.M.; Oskam, A.,
Thermochim. Acta, 1979, 33, 217. [all data]