Mo(CO)5(py)
- Formula: C10H5MoNO5
- Molecular weight: 315.11

Gas phase thermochemistry data

Data compiled by: José A. Martinho Simões
Quantity | Value | Units | Method | Reference | Comment |
---|---|---|---|---|---|
ΔfH°gas | -619.4 ± 4.2 | kJ/mol | Review | Martinho Simões | The enthalpy of formation relies on -915.3 ± 2.1 kJ/mol for the enthalpy of formation of Mo(CO)6(g) |

Phase change data

Data compiled by: José A. Martinho Simões
Quantity | Value | Units | Method | Reference | Comment |
---|---|---|---|---|---|
ΔsubH° | 102.0 ± 2.0 | kJ/mol | DSC | Daamen, Ernsting, et al., 1979 |

Reaction thermochemistry data

Data compiled by: José A. Martinho Simões
Individual Reactions
C10H5MoNO5 (cr) + (g) =
(g) +
(g)
By formula: C10H5MoNO5 (cr) + CO (g) = C6MoO6 (g) + C4H4N2 (g)
Quantity | Value | Units | Method | Reference | Comment |
---|---|---|---|---|---|
ΔrH° | 57. ± 3. | kJ/mol | DSC | Daamen, van der Poel, et al., 1979 |

Condensed phase thermochemistry data

Data compiled by: José A. Martinho Simões
Quantity | Value | Units | Method | Reference | Comment |
---|---|---|---|---|---|
ΔfH°solid | -721.4 ± 3.7 | kJ/mol | Review | Martinho Simões | The enthalpy of formation relies on -915.3 ± 2.1 kJ/mol for the enthalpy of formation of Mo(CO)6(g) |

References

Martinho Simões
Martinho Simões, J.A.,
Private communication (see http://webbook.nist.gov/chemistry/om/). [all data]
Daamen, Ernsting, et al., 1979
Daamen, H.; Ernsting, J.M.; Oskam, A.,
Thermochim. Acta, 1979, 33, 217. [all data]
Daamen, van der Poel, et al., 1979
Daamen, H.; van der Poel, H.; Stufkens, D.J.; Oskam, A.,
Thermochim. Acta, 1979, 34, 69. [all data]