Mo(CO)5(MeCN)

Phase change data

Data compiled by: José A. Martinho Simões

Quantity Value Units Method Reference Comment
Δsub105.8 ± 5.6kJ/molN/ACavell, Ernsting, et al., 1980

References

Cavell, Ernsting, et al., 1980
Cavell, K.J.; Ernsting, J.M.; Stufkens, D.J., Thermochim. Acta, 1980, 42, 343. [all data]